BDBM50200396 (R)-1-(5,8-dihydroxy-1,4-dioxo-1,4-dihydronaphthalen-2-yl)-4-methylpent-3-enyl 3-methylbutanoate::CHEMBL395857
SMILES [#6]-[#6](-[#6])-[#6]-[#6](=O)-[#8]-[#6](=[#6]\[#6]=[#6](\[#6])-[#6])-c1cc(-[#8])c2c(-[#8])ccc(-[#8])c2c1-[#8]
InChI Key InChIKey=RCLASMSCTFWRIF-UHFFFAOYSA-N
Data  4 IC50
  Tab Delimited (TSV)   2D SDfile   Computed 3D by Vconf -m prep SDfile
Find this compound or compounds like it in BindingDB:
Activity Spreadsheet -- Enzyme Inhibition Constant Data from BindingDB
Found 2 hits for monomerid = 50200396
TargetSterol O-acyltransferase 2(Homo sapiens (Human))
National Research Laboratory Of Lipid Metabolism And Atherosclerosis
Curated by ChEMBL
LigandPNGBDBM50200396((R)-1-(5,8-dihydroxy-1,4-dioxo-1,4-dihydronaphthal...)
Affinity DataIC50:  800nM. Assay description: Inhibition of human ACAT2 expressed in AC29 cells by cell-based fluorescent assay system
In DepthDetails ArticlePubMed
TargetSterol O-acyltransferase 2(Homo sapiens (Human))
National Research Laboratory Of Lipid Metabolism And Atherosclerosis
Curated by ChEMBL
LigandPNGBDBM50200396((R)-1-(5,8-dihydroxy-1,4-dioxo-1,4-dihydronaphthal...)
Affinity DataIC50:  2.51E+4nM. Assay description: Inhibition of human ACAT2 expressed in Hi5 cells
In DepthDetails ArticlePubMed